Reaction Details
TargetGlutamate carboxypeptidase 2
LigandBDBM50360218
Substrate/Competitorn/a
Meas. Tech.ChEMBL_794160 (CHEMBL1931945)
Ki 20±n/a nM
Citation Plechanovová, AByun, YAlquicer, GSkultétyová, LMloochová, PNemcová, AKim, HJNavrátil, MMease, RLubkowski, JPomper, MKonvalinka, JRulíšek, LBarinka, C Novel substrate-based inhibitors of human glutamate carboxypeptidase II with enhanced lipophilicity. J Med Chem54:7535-46 (2011) 
 
Glutamate carboxypeptidase 2
Name:Glutamate carboxypeptidase 2
Type:PROTEIN
Mol. Mass.:84333.66
Organism:Homo sapiens (Human)
Description:ChEMBL_1497035
Residue:750
BDBM50360218
NameBDBM50360218
Synonyms:CHEMBL1927827
TypeSmall organic molecule
Emp. Form.C21H30IN3O6
Mol. Mass.547.3839
SMILESCCCCC[C@H](NC(=O)N[C@@H](CCCCNC(=O)c1ccc(I)cc1)C(O)=O)C(O)=O