Reaction Details
TargetTransient receptor potential cation channel subfamily V member 1
LigandBDBM50360238
Substrate/Competitorn/a
Meas. Tech.ChEMBL_794216 (CHEMBL1932041)
IC50 970±n/a nM
Citation Vidal-Mosquera, MFernández-Carvajal, AMoure, AValente, PPlanells-Cases, RGonzález-Ros, JMBujons, JFerrer-Montiel, AMesseguer, A Triazine-based vanilloid 1 receptor open channel blockers: design, synthesis, evaluation, and SAR analysis. J Med Chem54:7441-52 (2011) 
 
Transient receptor potential cation channel subfamily V member 1
Name:Transient receptor potential cation channel subfamily V member 1
Type:Transient Receptor
Mol. Mass.:94956.12
Organism:Rattus norvegicus (rat)
Description:O35433
Residue:838
BDBM50360238
NameBDBM50360238
Synonyms:CHEMBL1928214
TypeSmall organic molecule
Emp. Form.C26H37N7O2
Mol. Mass.479.6177
SMILESCOc1ccc(CCNc2nc(NCCCN(C)C)nc(NCCc3ccc(OC)cc3)n2)cc1