Reaction Details
TargetTransient receptor potential cation channel subfamily V member 1
LigandBDBM50360239
Substrate/Competitorn/a
Meas. Tech.ChEMBL_794216 (CHEMBL1932041)
IC50 1210±n/a nM
Citation Vidal-Mosquera, MFernández-Carvajal, AMoure, AValente, PPlanells-Cases, RGonzález-Ros, JMBujons, JFerrer-Montiel, AMesseguer, A Triazine-based vanilloid 1 receptor open channel blockers: design, synthesis, evaluation, and SAR analysis. J Med Chem54:7441-52 (2011) 
 
Transient receptor potential cation channel subfamily V member 1
Name:Transient receptor potential cation channel subfamily V member 1
Type:Transient Receptor
Mol. Mass.:94956.12
Organism:Rattus norvegicus (rat)
Description:O35433
Residue:838
BDBM50360239
NameBDBM50360239
Synonyms:CHEMBL1928215
TypeSmall organic molecule
Emp. Form.C24H29Cl4N7
Mol. Mass.557.346
SMILESCN(C)CCCNc1nc(NCCc2ccc(Cl)cc2Cl)nc(NCCc2ccc(Cl)cc2Cl)n1