Reaction Details
TargetTransient receptor potential cation channel subfamily V member 1
LigandBDBM50360251
Substrate/Competitorn/a
Meas. Tech.ChEMBL_794216 (CHEMBL1932041)
IC50 69100±n/a nM
Citation Vidal-Mosquera, MFernández-Carvajal, AMoure, AValente, PPlanells-Cases, RGonzález-Ros, JMBujons, JFerrer-Montiel, AMesseguer, A Triazine-based vanilloid 1 receptor open channel blockers: design, synthesis, evaluation, and SAR analysis. J Med Chem54:7441-52 (2011) 
 
Transient receptor potential cation channel subfamily V member 1
Name:Transient receptor potential cation channel subfamily V member 1
Type:Transient Receptor
Mol. Mass.:94956.12
Organism:Rattus norvegicus (rat)
Description:O35433
Residue:838
BDBM50360251
NameBDBM50360251
Synonyms:CHEMBL1928345
TypeSmall organic molecule
Emp. Form.C26H33N7O4
Mol. Mass.507.5847
SMILESCOC(=O)c1ccc(CNc2nc(NCCCN(C)C)nc(NCc3ccc(cc3)C(=O)OC)n2)cc1