Reaction Details
TargetTransient receptor potential cation channel subfamily V member 1
LigandBDBM50360253
Substrate/Competitorn/a
Meas. Tech.ChEMBL_794216 (CHEMBL1932041)
IC50 7000±n/a nM
Citation Vidal-Mosquera, MFernández-Carvajal, AMoure, AValente, PPlanells-Cases, RGonzález-Ros, JMBujons, JFerrer-Montiel, AMesseguer, A Triazine-based vanilloid 1 receptor open channel blockers: design, synthesis, evaluation, and SAR analysis. J Med Chem54:7441-52 (2011) 
 
Transient receptor potential cation channel subfamily V member 1
Name:Transient receptor potential cation channel subfamily V member 1
Type:Transient Receptor
Mol. Mass.:94956.12
Organism:Rattus norvegicus (rat)
Description:O35433
Residue:838
BDBM50360253
NameBDBM50360253
Synonyms:CHEMBL1928347
TypeSmall organic molecule
Emp. Form.C30H35N9
Mol. Mass.521.6592
SMILESCN(C)CCCNc1nc(nc(n1)N1CCc2[nH]c3ccccc3c2C1)N1CCc2[nH]c3ccccc3c2C1