Reaction Details
TargetTransient receptor potential cation channel subfamily V member 1
LigandBDBM50360259
Substrate/Competitorn/a
Meas. Tech.ChEMBL_794216 (CHEMBL1932041)
IC50 7050±n/a nM
Citation Vidal-Mosquera, MFernández-Carvajal, AMoure, AValente, PPlanells-Cases, RGonzález-Ros, JMBujons, JFerrer-Montiel, AMesseguer, A Triazine-based vanilloid 1 receptor open channel blockers: design, synthesis, evaluation, and SAR analysis. J Med Chem54:7441-52 (2011) 
 
Transient receptor potential cation channel subfamily V member 1
Name:Transient receptor potential cation channel subfamily V member 1
Type:Transient Receptor
Mol. Mass.:94956.12
Organism:Rattus norvegicus (rat)
Description:O35433
Residue:838
BDBM50360259
NameBDBM50360259
Synonyms:CHEMBL1928204
TypeSmall organic molecule
Emp. Form.C25H33F2N7O
Mol. Mass.485.5726
SMILESCN(C)CCOCCNc1nc(NCCc2ccc(F)cc2)nc(NCCc2ccc(F)cc2)n1