Reaction Details
TargetTransient receptor potential cation channel subfamily V member 1
LigandBDBM50360262
Substrate/Competitorn/a
Meas. Tech.ChEMBL_794216 (CHEMBL1932041)
IC50 18600±n/a nM
Citation Vidal-Mosquera, MFernández-Carvajal, AMoure, AValente, PPlanells-Cases, RGonzález-Ros, JMBujons, JFerrer-Montiel, AMesseguer, A Triazine-based vanilloid 1 receptor open channel blockers: design, synthesis, evaluation, and SAR analysis. J Med Chem54:7441-52 (2011) 
 
Transient receptor potential cation channel subfamily V member 1
Name:Transient receptor potential cation channel subfamily V member 1
Type:Transient Receptor
Mol. Mass.:94956.12
Organism:Rattus norvegicus (rat)
Description:O35433
Residue:838
BDBM50360262
NameBDBM50360262
Synonyms:CHEMBL1928207
TypeSmall organic molecule
Emp. Form.C27H36F2N8
Mol. Mass.510.6251
SMILESCN(C)CCN1CCN(CC1)c1nc(NCCc2ccc(F)cc2)nc(NCCc2ccc(F)cc2)n1