Reaction Details
TargetTransient receptor potential cation channel subfamily V member 1
LigandBDBM50360265
Substrate/Competitorn/a
Meas. Tech.ChEMBL_794216 (CHEMBL1932041)
IC50 6700±n/a nM
Citation Vidal-Mosquera, MFernández-Carvajal, AMoure, AValente, PPlanells-Cases, RGonzález-Ros, JMBujons, JFerrer-Montiel, AMesseguer, A Triazine-based vanilloid 1 receptor open channel blockers: design, synthesis, evaluation, and SAR analysis. J Med Chem54:7441-52 (2011) 
 
Transient receptor potential cation channel subfamily V member 1
Name:Transient receptor potential cation channel subfamily V member 1
Type:Transient Receptor
Mol. Mass.:94956.12
Organism:Rattus norvegicus (rat)
Description:O35433
Residue:838
BDBM50360265
NameBDBM50360265
Synonyms:CHEMBL1928210
TypeSmall organic molecule
Emp. Form.C23H29Cl2N7
Mol. Mass.474.429
SMILESCN(C)CCNc1nc(NCCc2ccc(Cl)cc2)nc(NCCc2ccc(Cl)cc2)n1