Reaction Details
TargetRibosomal protein S6 kinase alpha-3
LigandBDBM50360282
Substrate/Competitorn/a
Meas. Tech.ChEMBL_795810 (CHEMBL1936697)
IC50 19±n/a nM
Citation Kirrane, TMBoyer, SJBurke, JGuo, XSnow, RJSoleymanzadeh, LSwinamer, AZhang, YMadwed, JBKashem, MKugler, SO'Neill, MM Indole RSK inhibitors. Part 2: optimization of cell potency and kinase selectivity. Bioorg Med Chem Lett22:738-42 (2011) 
 
Ribosomal protein S6 kinase alpha-3
Name:Ribosomal protein S6 kinase alpha-3
Type:Serine/threonine-protein kinase
Mol. Mass.:83740.03
Organism:Homo sapiens (Human)
Description:The human RSK2 sequence differed from the Genbank entry NM_004586 at one residue, V45G. The protein was cloned and purified from baculovirus expression system.
Residue:740
BDBM50360282
NameBDBM50360282
Synonyms:CHEMBL1933143 | US9150577, 193
TypeSmall organic molecule
Emp. Form.C17H16N4O3
Mol. Mass.324.3339
SMILESCc1cc(NC(=O)c2ccc3cc4C(=O)NCCCn4c3c2)on1