Reaction Details
TargetRibosomal protein S6 kinase alpha-3
LigandBDBM50360291
Substrate/Competitorn/a
Meas. Tech.ChEMBL_795811 (CHEMBL1936698)
IC50 90±n/a nM
Citation Kirrane, TMBoyer, SJBurke, JGuo, XSnow, RJSoleymanzadeh, LSwinamer, AZhang, YMadwed, JBKashem, MKugler, SO'Neill, MM Indole RSK inhibitors. Part 2: optimization of cell potency and kinase selectivity. Bioorg Med Chem Lett22:738-42 (2011) 
 
Ribosomal protein S6 kinase alpha-3
Name:Ribosomal protein S6 kinase alpha-3
Type:Serine/threonine-protein kinase
Mol. Mass.:83740.03
Organism:Homo sapiens (Human)
Description:The human RSK2 sequence differed from the Genbank entry NM_004586 at one residue, V45G. The protein was cloned and purified from baculovirus expression system.
Residue:740
BDBM50360291
NameBDBM50360291
Synonyms:CHEMBL1933278 | US9150577, 114
TypeSmall organic molecule
Emp. Form.C22H20N6O2
Mol. Mass.400.4332
SMILESO=C(Nc1cnn(Cc2ccncc2)c1)c1ccc2cc3C(=O)NCCCn3c2c1