Reaction Details
TargetB1 bradykinin receptor
LigandBDBM50360416
Substrate/Competitorn/a
Meas. Tech.ChEMBL_796432 (CHEMBL1937747)
IC50 30±n/a nM
Citation Bryan, MCBiswas, KPeterkin, TARzasa, RMArik, LLehto, SGSun, HHsieh, FYXu, CFremeau, RTAllen, JR Chromenones as potent bradykinin B1 antagonists. Bioorg Med Chem Lett22:619-22 (2011) 
 
B1 bradykinin receptor
Name:B1 bradykinin receptor
Type:PROTEIN
Mol. Mass.:39519.62
Organism:Oryctolagus cuniculus
Description:ChEMBL_796432
Residue:352
BDBM50360416
NameBDBM50360416
Synonyms:CHEMBL1934260
TypeSmall organic molecule
Emp. Form.C32H31ClN2O3
Mol. Mass.527.053
SMILESClc1cccc2occ(-c3ccc(cc3)C(=O)N[C@H]3CCCc4cc(CN5CCCCC5)ccc34)c(=O)c12