Reaction Details
TargetCorticotropin-releasing factor receptor 1
LigandBDBM50360475
Substrate/Competitorn/a
Meas. Tech.ChEMBL_795613 (CHEMBL1936043)
Ki 11±n/a nM
Citation Abid Masood, MFarrant, EMorao, IBazin, MPerez, MBunnage, MEFancy, SAPeakman, T Lead diversification. Application to existing drug molecules: mifepristone 1 and antalarmin 8. Bioorg Med Chem Lett22:723-8 (2011) 
 
Corticotropin-releasing factor receptor 1
Name:Corticotropin-releasing factor receptor 1
Type:Enzyme
Mol. Mass.:50744.31
Organism:Homo sapiens (Human)
Description:P34998
Residue:444
BDBM50360475
NameBDBM50360475
Synonyms:CHEMBL1934751
TypeSmall organic molecule
Emp. Form.C25H36N4O
Mol. Mass.408.5795
SMILESCCCCN(CC)c1nc(C)nc2n(c(COC)c(C)c12)-c1c(C)cc(C)cc1C