Reaction Details
TargetMAP kinase-activated protein kinase 2
LigandBDBM50360571
Substrate/Competitorn/a
Meas. Tech.ChEMBL_795360 (CHEMBL1937260)
EC50 1.1±n/a nM
Citation Oubrie, AKaptein, Ade Zwart, EHoogenboom, NGoorden, Rvan de Kar, Bvan Hoek, Mde Kimpe, Vvan der Heijden, RBorsboom, JKazemier, Bde Roos, JScheffers, MLommerse, JSchultz-Fademrecht, CBarf, T Novel ATP competitive MK2 inhibitors with potent biochemical and cell-based activity throughout the series. Bioorg Med Chem Lett22:613-8 (2011) 
 
MAP kinase-activated protein kinase 2
Name:MAP kinase-activated protein kinase 2
Type:Serine/threonine-protein kinase
Mol. Mass.:45579.87
Organism:Homo sapiens (Human)
Description:P49137
Residue:400
BDBM50360571
NameBDBM50360571
Synonyms:CHEMBL1933171
TypeSmall organic molecule
Emp. Form.C23H22FN5O2
Mol. Mass.419.4515
SMILESFc1cccc(c1)C(=O)Nc1cc(ccn1)-c1cc2c([nH]1)C1(CCNCC1)CNC2=O