Reaction Details
TargetMAP kinase-activated protein kinase 2
LigandBDBM50360572
Substrate/Competitorn/a
Meas. Tech.ChEMBL_795360 (CHEMBL1937260)
EC50 2.6±n/a nM
Citation Oubrie, AKaptein, Ade Zwart, EHoogenboom, NGoorden, Rvan de Kar, Bvan Hoek, Mde Kimpe, Vvan der Heijden, RBorsboom, JKazemier, Bde Roos, JScheffers, MLommerse, JSchultz-Fademrecht, CBarf, T Novel ATP competitive MK2 inhibitors with potent biochemical and cell-based activity throughout the series. Bioorg Med Chem Lett22:613-8 (2011) 
 
MAP kinase-activated protein kinase 2
Name:MAP kinase-activated protein kinase 2
Type:Serine/threonine-protein kinase
Mol. Mass.:45579.87
Organism:Homo sapiens (Human)
Description:P49137
Residue:400
BDBM50360572
NameBDBM50360572
Synonyms:CHEMBL1933170
TypeSmall organic molecule
Emp. Form.C28H27N5O2
Mol. Mass.465.5463
SMILESCN1CCC2(CC1)CNC(=O)c1cc([nH]c21)-c1ccnc(NC(=O)c2ccc3ccccc3c2)c1