Reaction Details
TargetProstaglandin E2 receptor EP4 subtype
LigandBDBM35847
Substrate/Competitorn/a
Meas. Tech.ChEMBL_795669 (CHEMBL1936150)
Ki 3.1±n/a nM
Citation Kambe, TMaruyama, TNakano, MNakai, YYoshida, TMatsunaga, NOida, HKonaka, AMaruyama, TNakai, HToda, M Discovery of a novel EP2/EP4 dual agonist with high subtype-selectivity. Bioorg Med Chem Lett22:396-401 (2011) 
 
Prostaglandin E2 receptor EP4 subtype
Name:Prostaglandin E2 receptor EP4 subtype
Type:G-protein coupled receptor
Mol. Mass.:56175.66
Organism:Mus musculus (Mouse)
Description:n/a
Residue:513
BDBM35847
NameBDBM35847
Synonyms:(15S)-prostaglandin E2 (5Z,13E,15S)-11alpha,15-dihydroxy-9-oxoprosta-5,13-dien-1-oic acid CHEMBL548 PGE2 [3H]PGE2 prostaglandin E2
Typeradiolabeled ligand
Emp. Form.C20H32O5
Mol. Mass.352.4651
SMILESCCCCC[C@H](O)\C=C\[C@H]1[C@H](O)CC(=O)[C@@H]1C\C=C/CCCC(O)=O