Reaction Details
TargetProstaglandin E2 receptor EP1 subtype
LigandBDBM50360626
Substrate/Competitorn/a
Meas. Tech.ChEMBL_795666 (CHEMBL1936147)
Ki>10000±n/a nM
Citation Kambe, TMaruyama, TNakano, MNakai, YYoshida, TMatsunaga, NOida, HKonaka, AMaruyama, TNakai, HToda, M Discovery of a novel EP2/EP4 dual agonist with high subtype-selectivity. Bioorg Med Chem Lett22:396-401 (2011) 
 
Prostaglandin E2 receptor EP1 subtype
Name:Prostaglandin E2 receptor EP1 subtype
Type:G-protein coupled receptor
Mol. Mass.:43000.62
Organism:Mus musculus (Mouse)
Description:n/a
Residue:405
BDBM50360626
NameBDBM50360626
Synonyms:CHEMBL1933722
TypeSmall organic molecule
Emp. Form.C21H24N2O4S2
Mol. Mass.432.556
SMILESCc1cccc(C[C@H](O)\C=C\[C@H]2CCC(=O)N2CCSc2nc(cs2)C(O)=O)c1