Reaction Details
TargetCarbonic anhydrase 1
LigandBDBM12342
Substrate/Competitorn/a
Meas. Tech.ChEMBL_796747 (CHEMBL1938062)
Ki 3100±n/a nM
Citation Carta, FMaresca, AScozzafava, ASupuran, CT 5- and 6-membered (thio)lactones are prodrug type carbonic anhydrase inhibitors. Bioorg Med Chem Lett22:267-70 (2011) 
 
Carbonic anhydrase 1
Name:Carbonic anhydrase 1
Type:Enzyme
Mol. Mass.:28873.37
Organism:Homo sapiens (Human)
Description:P00915
Residue:261
BDBM12342
NameBDBM12342
Synonyms:2H-chromen-2-one Coumarin
TypeNatural product
Emp. Form.C9H6O2
Mol. Mass.146.1427
SMILESO=c1ccc2ccccc2o1