Reaction Details
TargetAcetylcholinesterase
LigandBDBM50360906
Substrate/Competitorn/a
Meas. Tech.ChEMBL_795673 (CHEMBL1936154)
IC50 480±n/a nM
Citation Ashraf Ali, MIsmail, RChoon, TSKumar, RSOsman, HArumugam, NAlmansour, AIElumalai, KSingh, A AChE inhibitor: a regio- and stereo-selective 1,3-dipolar cycloaddition for the synthesis of novel substituted 5,6-dimethoxy spiro[5.3']-oxindole-spiro-[6.3¿]-2,3-dihydro-1H-inden-1¿-one-7-(substituted aryl)-tetrahydro-1H-pyrrolo[1,2-c][1,3]thiazole. Bioorg Med Chem Lett22:508-11 (2011) 
 
Acetylcholinesterase
Name:Acetylcholinesterase
Type:Enzyme
Mol. Mass.:71812.79
Organism:Electrophorus electricus (Electric eel)
Description:n/a
Residue:633
BDBM50360906
NameBDBM50360906
Synonyms:CHEMBL1935141
TypeSmall organic molecule
Emp. Form.C28H25N3O4S
Mol. Mass.499.581
SMILESCOc1cc2CC3(C(C4CSCN4C33C(=O)Nc4ccccc34)c3ccncc3)C(=O)c2cc1OC