Reaction Details
TargetAcetylcholinesterase
LigandBDBM50360913
Substrate/Competitorn/a
Meas. Tech.ChEMBL_795673 (CHEMBL1936154)
IC50 2240±n/a nM
Citation Ashraf Ali, MIsmail, RChoon, TSKumar, RSOsman, HArumugam, NAlmansour, AIElumalai, KSingh, A AChE inhibitor: a regio- and stereo-selective 1,3-dipolar cycloaddition for the synthesis of novel substituted 5,6-dimethoxy spiro[5.3']-oxindole-spiro-[6.3¿]-2,3-dihydro-1H-inden-1¿-one-7-(substituted aryl)-tetrahydro-1H-pyrrolo[1,2-c][1,3]thiazole. Bioorg Med Chem Lett22:508-11 (2011) 
 
Acetylcholinesterase
Name:Acetylcholinesterase
Type:Enzyme
Mol. Mass.:71812.79
Organism:Electrophorus electricus (Electric eel)
Description:n/a
Residue:633
BDBM50360913
NameBDBM50360913
Synonyms:CHEMBL1935148
TypeSmall organic molecule
Emp. Form.C31H29ClN2O6S
Mol. Mass.593.09
SMILESCOc1ccc(cc1OC)C1C2CSCN2C2(C(=O)Nc3ccc(Cl)cc23)C11Cc2cc(OC)c(OC)cc2C1=O