Reaction Details
TargetAcetylcholinesterase
LigandBDBM50360918
Substrate/Competitorn/a
Meas. Tech.ChEMBL_795673 (CHEMBL1936154)
IC50 2100±n/a nM
Citation Ashraf Ali, MIsmail, RChoon, TSKumar, RSOsman, HArumugam, NAlmansour, AIElumalai, KSingh, A AChE inhibitor: a regio- and stereo-selective 1,3-dipolar cycloaddition for the synthesis of novel substituted 5,6-dimethoxy spiro[5.3']-oxindole-spiro-[6.3¿]-2,3-dihydro-1H-inden-1¿-one-7-(substituted aryl)-tetrahydro-1H-pyrrolo[1,2-c][1,3]thiazole. Bioorg Med Chem Lett22:508-11 (2011) 
 
Acetylcholinesterase
Name:Acetylcholinesterase
Type:Enzyme
Mol. Mass.:71812.79
Organism:Electrophorus electricus (Electric eel)
Description:n/a
Residue:633
BDBM50360918
NameBDBM50360918
Synonyms:CHEMBL1935153
TypeSmall organic molecule
Emp. Form.C31H29N3O8S
Mol. Mass.603.642
SMILESCOc1ccc(cc1OC)C1C2CSCN2C2(C(=O)Nc3ccc(cc23)[N+]([O-])=O)C11Cc2cc(OC)c(OC)cc2C1=O