Reaction Details
TargetAcetylcholinesterase
LigandBDBM50360920
Substrate/Competitorn/a
Meas. Tech.ChEMBL_795673 (CHEMBL1936154)
IC50 3160±n/a nM
Citation Ashraf Ali, MIsmail, RChoon, TSKumar, RSOsman, HArumugam, NAlmansour, AIElumalai, KSingh, A AChE inhibitor: a regio- and stereo-selective 1,3-dipolar cycloaddition for the synthesis of novel substituted 5,6-dimethoxy spiro[5.3']-oxindole-spiro-[6.3¿]-2,3-dihydro-1H-inden-1¿-one-7-(substituted aryl)-tetrahydro-1H-pyrrolo[1,2-c][1,3]thiazole. Bioorg Med Chem Lett22:508-11 (2011) 
 
Acetylcholinesterase
Name:Acetylcholinesterase
Type:Enzyme
Mol. Mass.:71812.79
Organism:Electrophorus electricus (Electric eel)
Description:n/a
Residue:633
BDBM50360920
NameBDBM50360920
Synonyms:CHEMBL1935155
TypeSmall organic molecule
Emp. Form.C29H25N3O6S
Mol. Mass.543.59
SMILESCOc1cc2CC3(C(C4CSCN4C33C(=O)Nc4ccc(cc34)[N+]([O-])=O)c3ccccc3)C(=O)c2cc1OC