Reaction Details
Target5-hydroxytryptamine receptor 6
LigandBDBM50361052
Substrate/Competitorn/a
Meas. Tech.ChEMBL_796061 (CHEMBL1936931)
Ki 9.8±n/a nM
Citation Sundar, BGBailey, TRDunn, DDBacon, ERSalvino, JMMorton, GCAimone, LDZeqi, HMathiasen, JRDicamillo, AHuffman, MJMcKenna, BAKopec, KLu, LDBrown, RQian, JAngeles, TConnors, TSpais, CHolskin, BGalinis, DDuzic, ESchaffhauser, HRosse, GC Novel brain penetrant benzofuropiperidine 5-HT6 receptor antagonists. Bioorg Med Chem Lett22:120-3 (2011) 
 
5-hydroxytryptamine receptor 6
Name:5-hydroxytryptamine receptor 6
Type:Enzyme Catalytic Domain
Mol. Mass.:46945.51
Organism:RAT
Description:5-HT6 HTR6 RAT::P31388
Residue:436
BDBM50361052
NameBDBM50361052
Synonyms:CHEMBL1935589 | CHEMBL1949758
TypeSmall organic molecule
Emp. Form.C17H15NO3S
Mol. Mass.313.371
SMILESO=S(=O)(c1ccccc1)c1ccc2c3CCNCc3oc2c1