Reaction Details
Target5-hydroxytryptamine receptor 6
LigandBDBM50361052
Substrate/Competitorn/a
Meas. Tech.ChEMBL_796060 (CHEMBL1936930)
Ki 2.7±n/a nM
Citation Sundar, BGBailey, TRDunn, DDBacon, ERSalvino, JMMorton, GCAimone, LDZeqi, HMathiasen, JRDicamillo, AHuffman, MJMcKenna, BAKopec, KLu, LDBrown, RQian, JAngeles, TConnors, TSpais, CHolskin, BGalinis, DDuzic, ESchaffhauser, HRosse, GC Novel brain penetrant benzofuropiperidine 5-HT6 receptor antagonists. Bioorg Med Chem Lett22:120-3 (2011) 
 
5-hydroxytryptamine receptor 6
Name:5-hydroxytryptamine receptor 6
Type:G Protein-Coupled Receptor (GPCR)
Mol. Mass.:46968.43
Organism:Homo sapiens (Human)
Description:P50406
Residue:440
BDBM50361052
NameBDBM50361052
Synonyms:CHEMBL1935589 | CHEMBL1949758
TypeSmall organic molecule
Emp. Form.C17H15NO3S
Mol. Mass.313.371
SMILESO=S(=O)(c1ccccc1)c1ccc2c3CCNCc3oc2c1