Reaction Details
Target5-hydroxytryptamine receptor 6
LigandBDBM50361058
Substrate/Competitorn/a
Meas. Tech.ChEMBL_796062 (CHEMBL1936932)
IC50 11.7±n/a nM
Citation Sundar, BGBailey, TRDunn, DDBacon, ERSalvino, JMMorton, GCAimone, LDZeqi, HMathiasen, JRDicamillo, AHuffman, MJMcKenna, BAKopec, KLu, LDBrown, RQian, JAngeles, TConnors, TSpais, CHolskin, BGalinis, DDuzic, ESchaffhauser, HRosse, GC Novel brain penetrant benzofuropiperidine 5-HT6 receptor antagonists. Bioorg Med Chem Lett22:120-3 (2011) 
 
5-hydroxytryptamine receptor 6
Name:5-hydroxytryptamine receptor 6
Type:G Protein-Coupled Receptor (GPCR)
Mol. Mass.:46968.43
Organism:Homo sapiens (Human)
Description:P50406
Residue:440
BDBM50361058
NameBDBM50361058
Synonyms:CHEMBL1935594
TypeSmall organic molecule
Emp. Form.C19H18FNO3S
Mol. Mass.359.415
SMILESCC1(C)NCCc2c1oc1cc(ccc21)S(=O)(=O)c1cccc(F)c1