Reaction Details
TargetSerine/threonine-protein kinase PLK1
LigandBDBM50361097
Substrate/Competitorn/a
Meas. Tech.ChEMBL_795021 (CHEMBL1936401)
IC50>10000±n/a nM
Citation Caruso, MValsasina, BBallinari, DBertrand, JBrasca, MGCaldarelli, MCappella, PFiorentini, FGianellini, LMScolaro, ABeria, I 5-(2-amino-pyrimidin-4-yl)-1H-pyrrole and 2-(2-amino-pyrimidin-4-yl)-1,5,6,7-tetrahydro-pyrrolo[3,2-c]pyridin-4-one derivatives as new classes of selective and orally available Polo-like kinase 1 inhibitors. Bioorg Med Chem Lett22:96-101 (2011) 
 
Serine/threonine-protein kinase PLK1
Name:Serine/threonine-protein kinase PLK1
Type:Serine/threonine-protein kinase
Mol. Mass.:68277.16
Organism:Homo sapiens (Human)
Description:P53350
Residue:603
BDBM50361097
NameBDBM50361097
Synonyms:CHEMBL1933575
TypeSmall organic molecule
Emp. Form.C9H9N5O
Mol. Mass.203.2007
SMILESNC(=O)c1c[nH]c(c1)-c1ccnc(N)n1