Reaction Details
TargetAurora kinase A
LigandBDBM27351
Substrate/Competitorn/a
Meas. Tech.ChEMBL_795073 (CHEMBL1936499)
IC50>10000±n/a nM
Citation Caruso, MValsasina, BBallinari, DBertrand, JBrasca, MGCaldarelli, MCappella, PFiorentini, FGianellini, LMScolaro, ABeria, I 5-(2-amino-pyrimidin-4-yl)-1H-pyrrole and 2-(2-amino-pyrimidin-4-yl)-1,5,6,7-tetrahydro-pyrrolo[3,2-c]pyridin-4-one derivatives as new classes of selective and orally available Polo-like kinase 1 inhibitors. Bioorg Med Chem Lett22:96-101 (2011) 
 
Aurora kinase A
Name:Aurora kinase A
Type:Serine/threonine-protein kinase
Mol. Mass.:45830.98
Organism:Homo sapiens (Human)
Description:O14965
Residue:403
BDBM27351
NameBDBM27351
Synonyms:2-(2-aminopyrimidin-4-yl)-1H,4H,5H,6H,7H-pyrrolo[3,2-c]pyridin-4-one | Pyrrolopyridinone, 5
TypeSmall organic molecule
Emp. Form.C11H11N5O
Mol. Mass.229.2379
SMILESNc1nccc(n1)-c1cc2c(CCNC2=O)[nH]1