Reaction Details
TargetAurora kinase A
LigandBDBM50361096
Substrate/Competitorn/a
Meas. Tech.ChEMBL_795073 (CHEMBL1936499)
IC50>10000±n/a nM
Citation Caruso, MValsasina, BBallinari, DBertrand, JBrasca, MGCaldarelli, MCappella, PFiorentini, FGianellini, LMScolaro, ABeria, I 5-(2-amino-pyrimidin-4-yl)-1H-pyrrole and 2-(2-amino-pyrimidin-4-yl)-1,5,6,7-tetrahydro-pyrrolo[3,2-c]pyridin-4-one derivatives as new classes of selective and orally available Polo-like kinase 1 inhibitors. Bioorg Med Chem Lett22:96-101 (2011) 
 
Aurora kinase A
Name:Aurora kinase A
Type:Serine/threonine-protein kinase
Mol. Mass.:45830.98
Organism:Homo sapiens (Human)
Description:O14965
Residue:403
BDBM50361096
NameBDBM50361096
Synonyms:CHEMBL1933585
TypeSmall organic molecule
Emp. Form.C29H34F3N7O4
Mol. Mass.601.62
SMILESCN1CCN(CC1)c1ccc(OC(F)(F)F)c(Nc2nccc(n2)-c2cc3c(CCN(C(=O)OC(C)(C)C)C3=O)n2C)c1