Reaction Details
TargetHistone deacetylase 1
LigandBDBM50361255
Substrate/Competitorn/a
Meas. Tech.ChEMBL_795336 (CHEMBL1937192)
Kd 31000±n/a nM
Citation Henkes, LMHaus, PJäger, FLudwig, JMeyer-Almes, FJ Synthesis and biochemical analysis of 2,2,3,3,4,4,5,5,6,6,7,7-dodecafluoro-N-hydroxy-octanediamides as inhibitors of human histone deacetylases. Bioorg Med Chem20:985-95 (2012) 
 
Histone deacetylase 1
Name:Histone deacetylase 1
Type:Enzyme
Mol. Mass.:55090.27
Organism:Homo sapiens (Human)
Description:Q13547
Residue:482
BDBM50361255
NameBDBM50361255
Synonyms:CHEMBL1934897
TypeSmall organic molecule
Emp. Form.C20H12F12N2O3
Mol. Mass.556.3017
SMILESONC(=O)C(F)(F)C(F)(F)C(F)(F)C(F)(F)C(F)(F)C(F)(F)C(=O)Nc1ccc(cc1)-c1ccccc1