Reaction Details
TargetHistone deacetylase 6
LigandBDBM50361253
Substrate/Competitorn/a
Meas. Tech.ChEMBL_795337 (CHEMBL1937193)
Kd 4200±n/a nM
Citation Henkes, LMHaus, PJäger, FLudwig, JMeyer-Almes, FJ Synthesis and biochemical analysis of 2,2,3,3,4,4,5,5,6,6,7,7-dodecafluoro-N-hydroxy-octanediamides as inhibitors of human histone deacetylases. Bioorg Med Chem20:985-95 (2012) 
 
Histone deacetylase 6
Name:Histone deacetylase 6
Type:Chromatin regulator; hydrolase; repressor
Mol. Mass.:131381.51
Organism:Homo sapiens (Human)
Description:Q9UBN7
Residue:1215
BDBM50361253
NameBDBM50361253
Synonyms:CHEMBL1934895
TypeSmall organic molecule
Emp. Form.C14H7F12IN2O3
Mol. Mass.606.1023
SMILESONC(=O)C(F)(F)C(F)(F)C(F)(F)C(F)(F)C(F)(F)C(F)(F)C(=O)Nc1ccc(I)cc1