Reaction Details
TargetHistone deacetylase 6
LigandBDBM50361264
Substrate/Competitorn/a
Meas. Tech.ChEMBL_795337 (CHEMBL1937193)
Kd 9200±n/a nM
Citation Henkes, LMHaus, PJäger, FLudwig, JMeyer-Almes, FJ Synthesis and biochemical analysis of 2,2,3,3,4,4,5,5,6,6,7,7-dodecafluoro-N-hydroxy-octanediamides as inhibitors of human histone deacetylases. Bioorg Med Chem20:985-95 (2012) 
 
Histone deacetylase 6
Name:Histone deacetylase 6
Type:Chromatin regulator; hydrolase; repressor
Mol. Mass.:131381.51
Organism:Homo sapiens (Human)
Description:Q9UBN7
Residue:1215
BDBM50361264
NameBDBM50361264
Synonyms:CHEMBL1934906
TypeSmall organic molecule
Emp. Form.C20H12F12N2O3
Mol. Mass.556.3017
SMILESONC(=O)C(F)(F)C(F)(F)C(F)(F)C(F)(F)C(F)(F)C(F)(F)C(=O)Nc1ccccc1-c1ccccc1