Reaction Details
TargetHistone deacetylase 7
LigandBDBM50361251
Substrate/Competitorn/a
Meas. Tech.ChEMBL_795338 (CHEMBL1937194)
Kd 13000±n/a nM
Citation Henkes, LMHaus, PJäger, FLudwig, JMeyer-Almes, FJ Synthesis and biochemical analysis of 2,2,3,3,4,4,5,5,6,6,7,7-dodecafluoro-N-hydroxy-octanediamides as inhibitors of human histone deacetylases. Bioorg Med Chem20:985-95 (2012) 
 
Histone deacetylase 7
Name:Histone deacetylase 7
Type:Chromatin regulator; hydrolase; repressor
Mol. Mass.:102942.62
Organism:Homo sapiens (Human)
Description:Q8WUI4
Residue:952
BDBM50361251
NameBDBM50361251
Synonyms:CHEMBL1934893
TypeSmall organic molecule
Emp. Form.C16H11F12N3O4
Mol. Mass.537.2571
SMILESCC(=O)Nc1ccc(NC(=O)C(F)(F)C(F)(F)C(F)(F)C(F)(F)C(F)(F)C(F)(F)C(=O)NO)cc1