Reaction Details
TargetHistone deacetylase 7
LigandBDBM50361267
Substrate/Competitorn/a
Meas. Tech.ChEMBL_795338 (CHEMBL1937194)
Kd 13000±n/a nM
Citation Henkes, LMHaus, PJäger, FLudwig, JMeyer-Almes, FJ Synthesis and biochemical analysis of 2,2,3,3,4,4,5,5,6,6,7,7-dodecafluoro-N-hydroxy-octanediamides as inhibitors of human histone deacetylases. Bioorg Med Chem20:985-95 (2012) 
 
Histone deacetylase 7
Name:Histone deacetylase 7
Type:Chromatin regulator; hydrolase; repressor
Mol. Mass.:102942.62
Organism:Homo sapiens (Human)
Description:Q8WUI4
Residue:952
BDBM50361267
NameBDBM50361267
Synonyms:CHEMBL1934909
TypeSmall organic molecule
Emp. Form.C22H12F12N2O3
Mol. Mass.580.3231
SMILESONC(=O)C(F)(F)C(F)(F)C(F)(F)C(F)(F)C(F)(F)C(F)(F)C(=O)Nc1cccc2cc3ccccc3cc12