Reaction Details
TargetAdenosine receptor A2b
LigandBDBM50117109
Substrate/Competitorn/a
Meas. Tech.ChEMBL_794939 (CHEMBL1936218)
Ki 200±n/a nM
Citation Baraldi, PGSaponaro, GAghazadeh Tabrizi, MBaraldi, SRomagnoli, RMoorman, ARVarani, KBorea, PAPreti, D Pyrrolo- and pyrazolo-[3,4-e][1,2,4]triazolo[1,5-c]pyrimidines as adenosine receptor antagonists. Bioorg Med Chem20:1046-59 (2012) 
 
Adenosine receptor A2b
Name:Adenosine receptor A2b
Type:G Protein-Coupled Receptor (GPCR)
Mol. Mass.:36341.22
Organism:Homo sapiens (Human)
Description:n/a
Residue:332
BDBM50117109
NameBDBM50117109
Synonyms:1-(2-Furan-2-yl-8-methyl-8H-pyrazolo[4,3-e][1,2,4]triazolo[1,5-c]pyrimidin-5-yl)-3-pyridin-4-yl-urea CHEMBL332091
TypeSmall organic molecule
Emp. Form.C17H13N9O2
Mol. Mass.375.3442
SMILESCn1cc2c(n1)nc(NC(=O)Nc1ccncc1)n1nc(nc21)-c1ccco1