Reaction Details
TargetBeta-secretase 1
LigandBDBM50310823
Substrate/Competitorn/a
Meas. Tech.ChEMBL_795222 (CHEMBL1936881)
IC50 32200±n/a nM
Citation Marumoto, SMiyazawa, M Structure-activity relationships for naturally occurring coumarins asß-secretase inhibitor. Bioorg Med Chem20:784-8 (2012) 
 
Beta-secretase 1
Name:Beta-secretase 1
Type:Protein
Mol. Mass.:55755.10
Organism:Homo sapiens (Human)
Description:P56817
Residue:501
BDBM50310823
NameBDBM50310823
Synonyms:CHEMBL1078442 | bergamottin
TypeSmall organic molecule
Emp. Form.C21H22O4
Mol. Mass.338.397
SMILES[#6]\[#6](-[#6])=[#6]\[#6]-[#6]\[#6](-[#6])=[#6]\[#6]-[#8]-c1c2ccoc2cc2oc(=O)ccc12