Reaction Details
TargetLysine-specific demethylase 2A
LigandBDBM50361471
Substrate/Competitorn/a
Meas. Tech.ChEMBL_797221 (CHEMBL1942536)
IC50 106000±n/a nM
Citation Suzuki, TMiyata, N Lysine demethylases inhibitors. J Med Chem54:8236-50 (2011) 
 
Lysine-specific demethylase 2A
Name:Lysine-specific demethylase 2A
Type:Enzyme Catalytic Domain
Mol. Mass.:132809.04
Organism:Homo sapiens (Human)
Description:n/a
Residue:1162
BDBM50361471
NameBDBM50361471
Synonyms:CHEMBL1614745
TypeSmall organic molecule
Emp. Form.C5H8O5
Mol. Mass.148.114
SMILESO[C@H](CCC(O)=O)C(O)=O