Reaction Details
TargetLysine-specific demethylase 4C
LigandBDBM50324535
Substrate/Competitorn/a
Meas. Tech.ChEMBL_797222 (CHEMBL1942537)
IC50 1000±n/a nM
Citation Suzuki, TMiyata, N Lysine demethylases inhibitors. J Med Chem54:8236-50 (2011) 
 
Lysine-specific demethylase 4C
Name:Lysine-specific demethylase 4C
Type:Protein
Mol. Mass.:119979.01
Organism:Homo sapiens (Human)
Description:Q9H3R0
Residue:1056
BDBM50324535
NameBDBM50324535
Synonyms:3-{[9-(Dimethylamino)nonanoyl](hydroxy)amino}propanoicAcid Hydrochloride CHEMBL1229308
TypeSmall organic molecule
Emp. Form.C14H28N2O4
Mol. Mass.288.3831
SMILESCN(C)CCCCCCCCC(=O)N(O)CCC(O)=O