Reaction Details
TargetLysine-specific demethylase 4C
LigandBDBM50361475
Substrate/Competitorn/a
Meas. Tech.ChEMBL_797222 (CHEMBL1942537)
IC50 3400±n/a nM
Citation Suzuki, TMiyata, N Lysine demethylases inhibitors. J Med Chem54:8236-50 (2011) 
 
Lysine-specific demethylase 4C
Name:Lysine-specific demethylase 4C
Type:Protein
Mol. Mass.:119979.01
Organism:Homo sapiens (Human)
Description:Q9H3R0
Residue:1056
BDBM50361475
NameBDBM50361475
Synonyms:CHEMBL1938900
TypeSmall organic molecule
Emp. Form.C27H29N3O6
Mol. Mass.491.5357
SMILESON(CCCCNCc1ccc(COC(=O)Nc2cccc3ccccc23)cc1)C(=O)C=CC(O)=O