Reaction Details
TargetProlyl hydroxylase EGLN2
LigandBDBM50361475
Substrate/Competitorn/a
Meas. Tech.ChEMBL_797226 (CHEMBL1942541)
IC50 54000±n/a nM
Citation Suzuki, TMiyata, N Lysine demethylases inhibitors. J Med Chem54:8236-50 (2011) 
 
Prolyl hydroxylase EGLN2
Name:Prolyl hydroxylase EGLN2
Type:Protein
Mol. Mass.:43657.01
Organism:Homo sapiens (Human)
Description:Q96KS0
Residue:407
BDBM50361475
NameBDBM50361475
Synonyms:CHEMBL1938900
TypeSmall organic molecule
Emp. Form.C27H29N3O6
Mol. Mass.491.5357
SMILESON(CCCCNCc1ccc(COC(=O)Nc2cccc3ccccc23)cc1)C(=O)C=CC(O)=O