Reaction Details
TargetAmine oxidase [flavin-containing] A
LigandBDBM50361478
Substrate/Competitorn/a
Meas. Tech.ChEMBL_797214 (CHEMBL1942529)
Ki 16000±n/a nM
Citation Suzuki, TMiyata, N Lysine demethylases inhibitors. J Med Chem54:8236-50 (2011) 
 
Amine oxidase [flavin-containing] A
Name:Amine oxidase [flavin-containing] A
Type:Protein
Mol. Mass.:59689.53
Organism:Homo sapiens (Human)
Description:P21397
Residue:527
BDBM50361478
NameBDBM50361478
Synonyms:CHEMBL1938897
TypeSmall organic molecule
Emp. Form.C19H21NO2
Mol. Mass.295.3755
SMILESCC(NC1CC1c1ccccc1)c1ccc2OCCOc2c1