Reaction Details
TargetLysine-specific histone demethylase 1A
LigandBDBM50361479
Substrate/Competitorn/a
Meas. Tech.ChEMBL_797212 (CHEMBL1942527)
Ki 188000±n/a nM
Citation Suzuki, TMiyata, N Lysine demethylases inhibitors. J Med Chem54:8236-50 (2011) 
 
Lysine-specific histone demethylase 1A
Name:Lysine-specific histone demethylase 1A
Type:Enzyme
Mol. Mass.:92901.01
Organism:Homo sapiens (Human)
Description:O60341
Residue:852
BDBM50361479
NameBDBM50361479
Synonyms:CHEMBL1938899
TypeSmall organic molecule
Emp. Form.C10H13NO
Mol. Mass.163.2163
SMILESCOc1ccc(cc1)C1CC1N