Reaction Details
TargetAmine oxidase [flavin-containing] A
LigandBDBM50346534
Substrate/Competitorn/a
Meas. Tech.ChEMBL_797214 (CHEMBL1942529)
Ki 230000±n/a nM
Citation Suzuki, TMiyata, N Lysine demethylases inhibitors. J Med Chem54:8236-50 (2011) 
 
Amine oxidase [flavin-containing] A
Name:Amine oxidase [flavin-containing] A
Type:Protein
Mol. Mass.:59689.53
Organism:Homo sapiens (Human)
Description:P21397
Residue:527
BDBM50346534
NameBDBM50346534
Synonyms:CHEMBL1797705
TypeSmall organic molecule
Emp. Form.C27H29N3O3
Mol. Mass.443.5375
SMILESN[C@H]1C[C@@H]1c1cccc(OCC[C@H](NC(=O)c2ccccc2)C(=O)NCc2ccccc2)c1