Reaction Details
TargetAmine oxidase [flavin-containing] A
LigandBDBM50361605
Substrate/Competitorn/a
Meas. Tech.ChEMBL_799139 (CHEMBL1942123)
Ki 300±n/a nM
Citation Valente, STomassi, STempera, GSaccoccio, SAgostinelli, EMai, A Novel reversible monoamine oxidase A inhibitors: highly potent and selective 3-(1H-pyrrol-3-yl)-2-oxazolidinones. J Med Chem54:8228-32 (2011) 
 
Amine oxidase [flavin-containing] A
Name:Amine oxidase [flavin-containing] A
Type:PROTEIN
Mol. Mass.:59764.63
Organism:Bos taurus
Description:ChEMBL_1501477
Residue:527
BDBM50361605
NameBDBM50361605
Synonyms:CHEMBL1939850
TypeSmall organic molecule
Emp. Form.C10H14N2O3
Mol. Mass.210.2298
SMILESCOC[C@H]1CN(C(=O)O1)c1ccn(C)c1