Reaction Details
TargetAmine oxidase [flavin-containing] A
LigandBDBM50361613
Substrate/Competitorn/a
Meas. Tech.ChEMBL_799139 (CHEMBL1942123)
Ki 700±n/a nM
Citation Valente, STomassi, STempera, GSaccoccio, SAgostinelli, EMai, A Novel reversible monoamine oxidase A inhibitors: highly potent and selective 3-(1H-pyrrol-3-yl)-2-oxazolidinones. J Med Chem54:8228-32 (2011) 
 
Amine oxidase [flavin-containing] A
Name:Amine oxidase [flavin-containing] A
Type:PROTEIN
Mol. Mass.:59764.63
Organism:Bos taurus
Description:ChEMBL_1501477
Residue:527
BDBM50361613
NameBDBM50361613
Synonyms:CHEMBL1939857
TypeSmall organic molecule
Emp. Form.C11H15N3O2
Mol. Mass.221.2557
SMILESNC[C@H]1CN(C(=O)O1)c1ccn(CC=C)c1