Reaction Details
TargetAmine oxidase [flavin-containing] B
LigandBDBM50361607
Substrate/Competitorn/a
Meas. Tech.ChEMBL_799140 (CHEMBL1942124)
Ki 200000±n/a nM
Citation Valente, STomassi, STempera, GSaccoccio, SAgostinelli, EMai, A Novel reversible monoamine oxidase A inhibitors: highly potent and selective 3-(1H-pyrrol-3-yl)-2-oxazolidinones. J Med Chem54:8228-32 (2011) 
 
Amine oxidase [flavin-containing] B
Name:Amine oxidase [flavin-containing] B
Type:PROTEIN
Mol. Mass.:58428.94
Organism:Bos taurus
Description:ChEMBL_1501478
Residue:520
BDBM50361607
NameBDBM50361607
Synonyms:CHEMBL1938411
TypeSmall organic molecule
Emp. Form.C12H16N2O3
Mol. Mass.236.267
SMILESCOC[C@H]1CN(C(=O)O1)c1ccn(CC=C)c1