Reaction Details
TargetAmine oxidase [flavin-containing] B
LigandBDBM50361610
Substrate/Competitorn/a
Meas. Tech.ChEMBL_799140 (CHEMBL1942124)
Ki 100000±n/a nM
Citation Valente, STomassi, STempera, GSaccoccio, SAgostinelli, EMai, A Novel reversible monoamine oxidase A inhibitors: highly potent and selective 3-(1H-pyrrol-3-yl)-2-oxazolidinones. J Med Chem54:8228-32 (2011) 
 
Amine oxidase [flavin-containing] B
Name:Amine oxidase [flavin-containing] B
Type:PROTEIN
Mol. Mass.:58428.94
Organism:Bos taurus
Description:ChEMBL_1501478
Residue:520
BDBM50361610
NameBDBM50361610
Synonyms:CHEMBL1939854
TypeSmall organic molecule
Emp. Form.C11H13N5O2
Mol. Mass.247.2532
SMILESC=CCn1ccc(c1)N1C[C@H](CN=[N+]=[N-])OC1=O