Reaction Details
TargetProtein phosphatase 1D
LigandBDBM50361941
Substrate/Competitorn/a
Meas. Tech.ChEMBL_799042 (CHEMBL1941901)
IC50 480±n/a nM
Citation Yagi, HChuman, YKozakai, YImagawa, TTakahashi, YYoshimura, FTanino, KSakaguchi, K A small molecule inhibitor of p53-inducible protein phosphatase PPM1D. Bioorg Med Chem Lett22:729-32 (2011) 
 
Protein phosphatase 1D
Name:Protein phosphatase 1D
Type:PROTEIN
Mol. Mass.:66695.55
Organism:Homo sapiens (Human)
Description:ChEMBL_1515094
Residue:605
BDBM50361941
NameBDBM50361941
Synonyms:CHEMBL1939361
TypeSmall organic molecule
Emp. Form.C30H60O4Si2
Mol. Mass.540.966
SMILESCC[Si](CC)(CC)O[C@@H]1C[C@H](C)C[C@@H]2[C@@H]1C[C@H](O[Si](C)(C)C(C)(C)C)[C@@H]1[C@](C)(CO)C[C@H](O)C[C@@]21C