Reaction Details
TargetVascular endothelial growth factor receptor 3
LigandBDBM50362068
Substrate/Competitorn/a
Meas. Tech.ChEMBL_797354 (CHEMBL1942930)
IC50 7±n/a nM
Citation Plé, PAJung, FAshton, SHennequin, LLaine, RMorgentin, RPasquet, GTaylor, S Discovery of AZD2932, a new Quinazoline Ether Inhibitor with high affinity for VEGFR-2 and PDGFR tyrosine kinases. Bioorg Med Chem Lett22:262-6 (2011) 
 
Vascular endothelial growth factor receptor 3
Name:Vascular endothelial growth factor receptor 3
Type:Protein
Mol. Mass.:152749.58
Organism:Homo sapiens (Human)
Description:P35916-2
Residue:1363
BDBM50362068
NameBDBM50362068
Synonyms:CHEMBL1940112
TypeSmall organic molecule
Emp. Form.C27H30N6O5
Mol. Mass.518.5643
SMILESCOc1cccc(NC(=O)Cn2cc(Oc3ncnc4cc(OCCN5CCCC5)c(OC)cc34)cn2)c1