Reaction Details
TargetVascular endothelial growth factor receptor 3
LigandBDBM50362065
Substrate/Competitorn/a
Meas. Tech.ChEMBL_797354 (CHEMBL1942930)
IC50 0.200000±n/a nM
Citation Plé, PAJung, FAshton, SHennequin, LLaine, RMorgentin, RPasquet, GTaylor, S Discovery of AZD2932, a new Quinazoline Ether Inhibitor with high affinity for VEGFR-2 and PDGFR tyrosine kinases. Bioorg Med Chem Lett22:262-6 (2011) 
 
Vascular endothelial growth factor receptor 3
Name:Vascular endothelial growth factor receptor 3
Type:Protein
Mol. Mass.:152749.58
Organism:Homo sapiens (Human)
Description:P35916-2
Residue:1363
BDBM50362065
NameBDBM50362065
Synonyms:CHEMBL1940109
TypeSmall organic molecule
Emp. Form.C24H25N5O6
Mol. Mass.479.4852
SMILESCOCCOc1cc2ncnc(Oc3cnn(CC(=O)Nc4cccc(OC)c4)c3)c2cc1OC