Reaction Details
TargetVascular endothelial growth factor receptor 3
LigandBDBM50362083
Substrate/Competitorn/a
Meas. Tech.ChEMBL_797354 (CHEMBL1942930)
IC50 128±n/a nM
Citation Plé, PAJung, FAshton, SHennequin, LLaine, RMorgentin, RPasquet, GTaylor, S Discovery of AZD2932, a new Quinazoline Ether Inhibitor with high affinity for VEGFR-2 and PDGFR tyrosine kinases. Bioorg Med Chem Lett22:262-6 (2011) 
 
Vascular endothelial growth factor receptor 3
Name:Vascular endothelial growth factor receptor 3
Type:Protein
Mol. Mass.:152749.58
Organism:Homo sapiens (Human)
Description:P35916-2
Residue:1363
BDBM50362083
NameBDBM50362083
Synonyms:CHEMBL1940267
TypeSmall organic molecule
Emp. Form.C24H22N2O5
Mol. Mass.418.4419
SMILESCOc1cccc(COc2ccc(Oc3ncnc4cc(OC)c(OC)cc34)cc2)c1