Reaction Details
TargetPlatelet-derived growth factor receptor beta
LigandBDBM50362068
Substrate/Competitorn/a
Meas. Tech.ChEMBL_797353 (CHEMBL1942929)
IC50 1±n/a nM
Citation Plé, PAJung, FAshton, SHennequin, LLaine, RMorgentin, RPasquet, GTaylor, S Discovery of AZD2932, a new Quinazoline Ether Inhibitor with high affinity for VEGFR-2 and PDGFR tyrosine kinases. Bioorg Med Chem Lett22:262-6 (2011) 
 
Platelet-derived growth factor receptor beta
Name:Platelet-derived growth factor receptor beta
Type:Enzyme
Mol. Mass.:123922.25
Organism:Homo sapiens (Human)
Description:P09619
Residue:1106
BDBM50362068
NameBDBM50362068
Synonyms:CHEMBL1940112
TypeSmall organic molecule
Emp. Form.C27H30N6O5
Mol. Mass.518.5643
SMILESCOc1cccc(NC(=O)Cn2cc(Oc3ncnc4cc(OCCN5CCCC5)c(OC)cc34)cn2)c1